Reaction Details
TargetGlucocorticoid receptor
LigandBDBM50448169
Substrate/Competitorn/a
Meas. Tech.ChEMBL_1292840 (CHEMBL3122504)
Ki>100±n/a nM
Citation Carson, MWLuz, JGSuen, CMontrose, CZink, RRuan, XCheng, CCole, HAdrian, MDKohlman, DTMabry, TSnyder, NCondon, BMaletic, MClawson, DPustilnik, ACoghlan, MJ Glucocorticoid receptor modulators informed by crystallography lead to a new rationale for receptor selectivity, function, and implications for structure-based design. J Med Chem57:849-60 (2014) 
 
Glucocorticoid receptor
Name:Glucocorticoid receptor
Type:Enzyme
Mol. Mass.:85656.87
Organism:Homo sapiens (Human)
Description:P04150
Residue:777
BDBM50448169
NameBDBM50448169
Synonyms:CHEMBL3120316
TypeSmall organic molecule
Emp. Form.C22H19N
Mol. Mass.297.393
SMILES[#7]-c1cccc(\[#6]=[#6]-2/c3ccccc3-[#6]-[#6]-c3ccccc-23)c1