Reaction Details
TargetGlucocorticoid receptor
LigandBDBM50448165
Substrate/Competitorn/a
Meas. Tech.ChEMBL_1292840 (CHEMBL3122504)
Ki 0.226000±n/a nM
Citation Carson, MWLuz, JGSuen, CMontrose, CZink, RRuan, XCheng, CCole, HAdrian, MDKohlman, DTMabry, TSnyder, NCondon, BMaletic, MClawson, DPustilnik, ACoghlan, MJ Glucocorticoid receptor modulators informed by crystallography lead to a new rationale for receptor selectivity, function, and implications for structure-based design. J Med Chem57:849-60 (2014) 
 
Glucocorticoid receptor
Name:Glucocorticoid receptor
Type:Enzyme
Mol. Mass.:85656.87
Organism:Homo sapiens (Human)
Description:P04150
Residue:777
BDBM50448165
NameBDBM50448165
Synonyms:CHEMBL3120320
TypeSmall organic molecule
Emp. Form.C23H21NO2S
Mol. Mass.375.483
SMILES[#6]S(=O)(=O)[#7]-c1cccc(\[#6]=[#6]-2/c3ccccc3-[#6]-[#6]-c3ccccc-23)c1