Reaction Details
TargetAcetylcholinesterase
LigandBDBM50448216
Substrate/Competitorn/a
Meas. Tech.ChEMBL_1293181 (CHEMBL3123368)
IC50 65±n/a nM
Citation Oset-Gasque, MJGonzález, MPPérez-Peña, JGarcía-Font, NRomero, Adel Pino, JRamos, EHadjipavlou-Litina, DSoriano, EChioua, MSamadi, ARaghuvanshi, DSSingh, KNMarco-Contelles, J Toxicological and pharmacological evaluation, antioxidant, ADMET and molecular modeling of selected racemic chromenotacrines {11-amino-12-aryl-8,9,10,12-tetrahydro-7H-chromeno[2,3-b]quinolin-3-ols} for the potential prevention and treatment of Alzheimer's disease. Eur J Med Chem74:491-501 (2014) 
 
Acetylcholinesterase
Name:Acetylcholinesterase
Type:Enzyme
Mol. Mass.:71812.79
Organism:Electrophorus electricus (Electric eel)
Description:n/a
Residue:633
BDBM50448216
NameBDBM50448216
Synonyms:CHEMBL3120708
TypeSmall organic molecule
Emp. Form.C23H22N2O2
Mol. Mass.358.433
SMILESCc1ccc(cc1)C1c2ccc(O)cc2Oc2nc3CCCCc3c(N)c12