Reaction Details
TargetHistamine H3 receptor
LigandBDBM50448285
Substrate/Competitorn/a
Meas. Tech.ChEMBL_1293783 (CHEMBL3123355)
Ki 5.7±n/a nM
Citation Hudkins, RLJosef, KABecknell, NCAimone, LDLyons, JAMathiasen, JRGruner, JARaddatz, R Discovery of (1R,6S)-5-[4-(1-cyclobutyl-piperidin-4-yloxy)-phenyl]-3,4-diaza-bicyclo[4.1.0]hept-4-en-2-one (R,S-4a): histamine H(3) receptor inverse agonist demonstrating potent cognitive enhancing and wake promoting activity. Bioorg Med Chem Lett24:1303-6 (2014) 
 
Histamine H3 receptor
Name:Histamine H3 receptor
Type:G Protein-Coupled Receptor (GPCR)
Mol. Mass.:48607.98
Organism:Rattus norvegicus (rat)
Description:n/a
Residue:445
BDBM50448285
NameBDBM50448285
Synonyms:CHEMBL3121093
TypeSmall organic molecule
Emp. Form.C22H29N3O2
Mol. Mass.367.4846
SMILESCN1N=C(C2CC2C1=O)c1ccc(OC2CCN(CC2)C2CCCC2)cc1