Reaction Details
TargetCD209 antigen
LigandBDBM50448383
Substrate/Competitorn/a
Meas. Tech.ChEMBL_1292697 (CHEMBL3123564)
IC50>500000±n/a nM
Citation Tomašic, THajšek, DŠvajger, ULuzar, JObermajer, NPetit-Haertlein, IFieschi, FAnderluh, M Monovalent mannose-based DC-SIGN antagonists: targeting the hydrophobic groove of the receptor. Eur J Med Chem75:308-26 (2014) 
 
CD209 antigen
Name:CD209 antigen
Type:PROTEIN
Mol. Mass.:45768.84
Organism:Homo sapiens (Human)
Description:ChEMBL_104194
Residue:404
BDBM50448383
NameBDBM50448383
Synonyms:CHEMBL3121718
TypeSmall organic molecule
Emp. Form.C31H34O10
Mol. Mass.566.5957
SMILESCOc1ccc2ccc(OCC(CO[C@H]3O[C@H](CO)[C@@H](O)[C@H](O)[C@@H]3O)Oc3ccc4ccc(OC)cc4c3)cc2c1