Reaction Details
TargetCD209 antigen
LigandBDBM50448389
Substrate/Competitorn/a
Meas. Tech.ChEMBL_1292697 (CHEMBL3123564)
IC50 50000±n/a nM
Citation Tomašic, THajšek, DŠvajger, ULuzar, JObermajer, NPetit-Haertlein, IFieschi, FAnderluh, M Monovalent mannose-based DC-SIGN antagonists: targeting the hydrophobic groove of the receptor. Eur J Med Chem75:308-26 (2014) 
 
CD209 antigen
Name:CD209 antigen
Type:PROTEIN
Mol. Mass.:45768.84
Organism:Homo sapiens (Human)
Description:ChEMBL_104194
Residue:404
BDBM50448389
NameBDBM50448389
Synonyms:CHEMBL3121712
TypeSmall organic molecule
Emp. Form.C31H34O10
Mol. Mass.566.5957
SMILESCOc1ccc2ccc(OCC(COc3ccc4ccc(OC)cc4c3)O[C@H]3O[C@H](CO)[C@@H](O)[C@H](O)[C@@H]3O)cc2c1