Reaction Details
TargetCD209 antigen
LigandBDBM50448391
Substrate/Competitorn/a
Meas. Tech.ChEMBL_1292697 (CHEMBL3123564)
IC50>500000±n/a nM
Citation Tomašic, THajšek, DŠvajger, ULuzar, JObermajer, NPetit-Haertlein, IFieschi, FAnderluh, M Monovalent mannose-based DC-SIGN antagonists: targeting the hydrophobic groove of the receptor. Eur J Med Chem75:308-26 (2014) 
 
CD209 antigen
Name:CD209 antigen
Type:PROTEIN
Mol. Mass.:45768.84
Organism:Homo sapiens (Human)
Description:ChEMBL_104194
Residue:404
BDBM50448391
NameBDBM50448391
Synonyms:CHEMBL3121710
TypeSmall organic molecule
Emp. Form.C21H24N2O12
Mol. Mass.496.4215
SMILESOC[C@H]1O[C@H](OC(COc2ccc(cc2)[N+]([O-])=O)COc2ccc(cc2)[N+]([O-])=O)[C@@H](O)[C@@H](O)[C@@H]1O