Reaction Details
TargetCD209 antigen
LigandBDBM50448392
Substrate/Competitorn/a
Meas. Tech.ChEMBL_1292697 (CHEMBL3123564)
IC50 5150000±n/a nM
Citation Tomašic, THajšek, DŠvajger, ULuzar, JObermajer, NPetit-Haertlein, IFieschi, FAnderluh, M Monovalent mannose-based DC-SIGN antagonists: targeting the hydrophobic groove of the receptor. Eur J Med Chem75:308-26 (2014) 
 
CD209 antigen
Name:CD209 antigen
Type:PROTEIN
Mol. Mass.:45768.84
Organism:Homo sapiens (Human)
Description:ChEMBL_104194
Residue:404
BDBM50448392
NameBDBM50448392
Synonyms:CHEMBL3121709
TypeSmall organic molecule
Emp. Form.C23H30O10
Mol. Mass.466.4783
SMILESCOc1ccc(OCC(COc2ccc(OC)cc2)O[C@H]2O[C@H](CO)[C@@H](O)[C@H](O)[C@@H]2O)cc1