Reaction Details
TargetCD209 antigen
LigandBDBM50448394
Substrate/Competitorn/a
Meas. Tech.ChEMBL_1292697 (CHEMBL3123564)
IC50 6490000±n/a nM
Citation Tomašic, THajšek, DŠvajger, ULuzar, JObermajer, NPetit-Haertlein, IFieschi, FAnderluh, M Monovalent mannose-based DC-SIGN antagonists: targeting the hydrophobic groove of the receptor. Eur J Med Chem75:308-26 (2014) 
 
CD209 antigen
Name:CD209 antigen
Type:PROTEIN
Mol. Mass.:45768.84
Organism:Homo sapiens (Human)
Description:ChEMBL_104194
Residue:404
BDBM50448394
NameBDBM50448394
Synonyms:CHEMBL3121707
TypeSmall organic molecule
Emp. Form.C25H30N4O12
Mol. Mass.578.5253
SMILESOC[C@H]1O[C@H](OC(CNC(=O)Cc2ccc(cc2)[N+]([O-])=O)CNC(=O)Cc2ccc(cc2)[N+]([O-])=O)[C@@H](O)[C@@H](O)[C@@H]1O