Reaction Details
TargetCD209 antigen
LigandBDBM50448396
Substrate/Competitorn/a
Meas. Tech.ChEMBL_1292697 (CHEMBL3123564)
IC50 13250000±n/a nM
Citation Tomašic, THajšek, DŠvajger, ULuzar, JObermajer, NPetit-Haertlein, IFieschi, FAnderluh, M Monovalent mannose-based DC-SIGN antagonists: targeting the hydrophobic groove of the receptor. Eur J Med Chem75:308-26 (2014) 
 
CD209 antigen
Name:CD209 antigen
Type:PROTEIN
Mol. Mass.:45768.84
Organism:Homo sapiens (Human)
Description:ChEMBL_104194
Residue:404
BDBM50448396
NameBDBM50448396
Synonyms:CHEMBL3121705
TypeSmall organic molecule
Emp. Form.C19H26N4O8
Mol. Mass.438.4317
SMILESOC[C@H]1O[C@H](OC(CNC(=O)c2ccc[nH]2)CNC(=O)c2ccc[nH]2)[C@@H](O)[C@@H](O)[C@@H]1O