Reaction Details
TargetCD209 antigen
LigandBDBM50448401
Substrate/Competitorn/a
Meas. Tech.ChEMBL_1292697 (CHEMBL3123564)
IC50 420000±n/a nM
Citation Tomašic, THajšek, DŠvajger, ULuzar, JObermajer, NPetit-Haertlein, IFieschi, FAnderluh, M Monovalent mannose-based DC-SIGN antagonists: targeting the hydrophobic groove of the receptor. Eur J Med Chem75:308-26 (2014) 
 
CD209 antigen
Name:CD209 antigen
Type:PROTEIN
Mol. Mass.:45768.84
Organism:Homo sapiens (Human)
Description:ChEMBL_104194
Residue:404
BDBM50448401
NameBDBM50448401
Synonyms:CHEMBL3121700
TypeSmall organic molecule
Emp. Form.C32H43N5O11
Mol. Mass.673.7107
SMILESOC[C@H]1O[C@H](O[C@H]2C[C@@H]([C@H](C[C@@H]2OCCN=[N+]=[N-])C(=O)NCc2ccc(CO)cc2)C(=O)NCc2ccc(CO)cc2)[C@@H](O)[C@@H](O)[C@@H]1O