Reaction Details
TargetCD209 antigen
LigandBDBM50242419
Substrate/Competitorn/a
Meas. Tech.ChEMBL_1292698 (CHEMBL3123565)
Ki 6700000±n/a nM
Citation Tomašic, THajšek, DŠvajger, ULuzar, JObermajer, NPetit-Haertlein, IFieschi, FAnderluh, M Monovalent mannose-based DC-SIGN antagonists: targeting the hydrophobic groove of the receptor. Eur J Med Chem75:308-26 (2014) 
 
CD209 antigen
Name:CD209 antigen
Type:PROTEIN
Mol. Mass.:45768.84
Organism:Homo sapiens (Human)
Description:ChEMBL_104194
Residue:404
BDBM50242419
NameBDBM50242419
Synonyms:6-Deoxy-L-galactose CHEMBL469449 L-fucose
TypeSmall organic molecule
Emp. Form.C6H12O5
Mol. Mass.164.1565
SMILESC[C@@H]1OC(O)[C@@H](O)[C@H](O)[C@@H]1O