Reaction Details
TargetNeuronal acetylcholine receptor subunit alpha-3/beta-4
LigandBDBM50166908
Substrate/Competitorn/a
Meas. Tech.ChEMBL_1298238 (CHEMBL3130379)
EC50 55000±n/a nM
Citation Ondachi, PWCastro, AHBartkowiak, JMLuetje, CWDamaj, MIMascarella, SWNavarro, HACarroll, FI Synthesis, nicotinic acetylcholine receptor binding, and antinociceptive properties of 2'-fluoro-3'-(substituted pyridinyl)-7-deschloroepibatidine analogues. J Med Chem57:836-48 (2014) 
 
Neuronal acetylcholine receptor subunit alpha-3/beta-4
Name:Neuronal acetylcholine receptor subunit alpha-3/beta-4
Type:Protein
Mol. Mass.:n/a
Description:n/a
Components:This complex has 2 components.
Component 1
Name:Neuronal acetylcholine receptor subunit alpha-3
Synonyms:ACHA3_RAT Chrna3
Type:Enzyme
Mol. Mass.:56995.52
Organism:Rattus norvegicus (Rat)
Description:P04757
Residue:499
Component 2
Name:Neuronal acetylcholine receptor subunit beta-4
Synonyms:ACHB4_RAT Chrnb4 Neuronal acetylcholine receptor non-alpha-2 chain | Neuronal acetylcholine receptor protein beta-4 subunit
Type:Enzyme
Mol. Mass.:55863.89
Organism:Rattus norvegicus (Rat)
Description:P12392
Residue:495
BDBM50166908
NameBDBM50166908
Synonyms:5,8,14-triazatetracyclo[10.3.1.02,11.04,9]hexadeca-2(11),3,5,7,9-pentaene; dihydrochloride US9993465, Varenicline | VARENICLINE
TypeSmall organic molecule
Emp. Form.C13H13N3
Mol. Mass.211.2624
SMILESC1C2CNCC1c1cc3nccnc3cc21