Reaction Details
TargetNeuronal acetylcholine receptor subunit alpha-3/beta-4
LigandBDBM50448766
Substrate/Competitorn/a
Meas. Tech.ChEMBL_1298240 (CHEMBL3130381)
IC50 8000±n/a nM
Citation Ondachi, PWCastro, AHBartkowiak, JMLuetje, CWDamaj, MIMascarella, SWNavarro, HACarroll, FI Synthesis, nicotinic acetylcholine receptor binding, and antinociceptive properties of 2'-fluoro-3'-(substituted pyridinyl)-7-deschloroepibatidine analogues. J Med Chem57:836-48 (2014) 
 
Neuronal acetylcholine receptor subunit alpha-3/beta-4
Name:Neuronal acetylcholine receptor subunit alpha-3/beta-4
Type:Protein
Mol. Mass.:n/a
Description:n/a
Components:This complex has 2 components.
Component 1
Name:Neuronal acetylcholine receptor subunit alpha-3
Synonyms:ACHA3_RAT Chrna3
Type:Enzyme
Mol. Mass.:56995.52
Organism:Rattus norvegicus (Rat)
Description:P04757
Residue:499
Component 2
Name:Neuronal acetylcholine receptor subunit beta-4
Synonyms:ACHB4_RAT Chrnb4 Neuronal acetylcholine receptor non-alpha-2 chain | Neuronal acetylcholine receptor protein beta-4 subunit
Type:Enzyme
Mol. Mass.:55863.89
Organism:Rattus norvegicus (Rat)
Description:P12392
Residue:495
BDBM50448766
NameBDBM50448766
Synonyms:CHEMBL3128031
TypeSmall organic molecule
Emp. Form.C16H16FN3
Mol. Mass.269.3167
SMILESFc1ncc(cc1-c1ccncc1)[C@H]1C[C@H]2CC[C@H]1N2