Reaction Details
TargetMonoglyceride lipase
LigandBDBM50448893
Substrate/Competitorn/a
Meas. Tech.ChEMBL_1296365 (CHEMBL3129775)
IC50>100000±n/a nM
Citation Otrubova, KCravatt, BFBoger, DL Design, synthesis, and characterization ofa-ketoheterocycles that additionally target the cytosolic port Cys269 of fatty acid amide hydrolase. J Med Chem57:1079-89 (2014) 
 
Monoglyceride lipase
Name:Monoglyceride lipase
Type:Hydrolase
Mol. Mass.:33391.67
Organism:Mus musculus (mouse)
Description:Assays were using membranes of recombinant MAG Lipase transiently transfected in COS-7 cells.
Residue:303
BDBM50448893
NameBDBM50448893
Synonyms:CHEMBL3125287
TypeSmall organic molecule
Emp. Form.C24H26N2O4S
Mol. Mass.438.539
SMILESCS(=O)(=O)C=Cc1ccc(nc1)-c1cnc(o1)C(=O)CCCCCCc1ccccc1