Reaction Details
TargetNeutral cholesterol ester hydrolase 1
LigandBDBM50448892
Substrate/Competitorn/a
Meas. Tech.ChEMBL_1296364 (CHEMBL3129774)
IC50>100000±n/a nM
Citation Otrubova, KCravatt, BFBoger, DL Design, synthesis, and characterization ofa-ketoheterocycles that additionally target the cytosolic port Cys269 of fatty acid amide hydrolase. J Med Chem57:1079-89 (2014) 
 
Neutral cholesterol ester hydrolase 1
Name:Neutral cholesterol ester hydrolase 1
Type:Single-pass type II membrane protein; hydrolase
Mol. Mass.:45742.11
Organism:Mus musculus (mouse)
Description:Assays were using membranes of recombinant KIAA1363 transiently transfected in COS-7 cells.
Residue:408
BDBM50448892
NameBDBM50448892
Synonyms:CHEMBL3125288
TypeSmall organic molecule
Emp. Form.C24H26N2O3S
Mol. Mass.422.54
SMILESCS(=O)C=Cc1ccc(nc1)-c1cnc(o1)C(=O)CCCCCCc1ccccc1