Reaction Details
TargetNeutral cholesterol ester hydrolase 1
LigandBDBM50448896
Substrate/Competitorn/a
Meas. Tech.ChEMBL_1296364 (CHEMBL3129774)
IC50>100000±n/a nM
Citation Otrubova, KCravatt, BFBoger, DL Design, synthesis, and characterization ofa-ketoheterocycles that additionally target the cytosolic port Cys269 of fatty acid amide hydrolase. J Med Chem57:1079-89 (2014) 
 
Neutral cholesterol ester hydrolase 1
Name:Neutral cholesterol ester hydrolase 1
Type:Single-pass type II membrane protein; hydrolase
Mol. Mass.:45742.11
Organism:Mus musculus (mouse)
Description:Assays were using membranes of recombinant KIAA1363 transiently transfected in COS-7 cells.
Residue:408
BDBM50448896
NameBDBM50448896
Synonyms:CHEMBL3125307
TypeSmall organic molecule
Emp. Form.C23H23N3O2
Mol. Mass.373.4476
SMILESO=C(CCCCCCc1ccccc1)c1ncc(o1)-c1ccc(CC#N)cn1