Reaction Details
TargetFatty-acid amide hydrolase 1
LigandBDBM50448893
Substrate/Competitorn/a
Meas. Tech.ChEMBL_1296362 (CHEMBL3129772)
IC50 80±n/a nM
Citation Otrubova, KCravatt, BFBoger, DL Design, synthesis, and characterization ofa-ketoheterocycles that additionally target the cytosolic port Cys269 of fatty acid amide hydrolase. J Med Chem57:1079-89 (2014) 
 
Fatty-acid amide hydrolase 1
Name:Fatty-acid amide hydrolase 1
Type:Hydrolase; single-pass membrane protein; homodimer
Mol. Mass.:63227.28
Organism:Mus musculus (mouse)
Description:Mouse brain membranes were used in the assay.
Residue:579
BDBM50448893
NameBDBM50448893
Synonyms:CHEMBL3125287
TypeSmall organic molecule
Emp. Form.C24H26N2O4S
Mol. Mass.438.539
SMILESCS(=O)(=O)C=Cc1ccc(nc1)-c1cnc(o1)C(=O)CCCCCCc1ccccc1