Reaction Details
TargetNitric oxide synthase, inducible
LigandBDBM50122307
Substrate/Competitorn/a
Meas. Tech.ChEMBL_1298289 (CHEMBL3130554)
IC50 5000±n/a nM
Citation Cinelli, MALi, HChreifi, GMartásek, PRoman, LJPoulos, TLSilverman, RB Simplified 2-aminoquinoline-based scaffold for potent and selective neuronal nitric oxide synthase inhibition. J Med Chem57:1513-30 (2014) 
 
Nitric oxide synthase, inducible
Name:Nitric oxide synthase, inducible
Type:Enzyme
Mol. Mass.:130595.79
Organism:Mus musculus (mouse)
Description:Recombinant enzyme overexpressed in E. coli.
Residue:1144
BDBM50122307
NameBDBM50122307
Synonyms:CHEMBL293212 | N-{4-[2-(3-Chloro-benzylamino)-ethyl]-phenyl}-thiophene-2-carboxamidine; hydrochloride
TypeSmall organic molecule
Emp. Form.C20H20ClN3S
Mol. Mass.369.911
SMILESNC(=Nc1ccc(CCNCc2cccc(Cl)c2)cc1)c1cccs1