Reaction Details
TargetNitric oxide synthase, inducible
LigandBDBM50328814
Substrate/Competitorn/a
Meas. Tech.ChEMBL_1298289 (CHEMBL3130554)
Ki 5800±n/a nM
Citation Cinelli, MALi, HChreifi, GMartásek, PRoman, LJPoulos, TLSilverman, RB Simplified 2-aminoquinoline-based scaffold for potent and selective neuronal nitric oxide synthase inhibition. J Med Chem57:1513-30 (2014) 
 
Nitric oxide synthase, inducible
Name:Nitric oxide synthase, inducible
Type:Enzyme
Mol. Mass.:130595.79
Organism:Mus musculus (mouse)
Description:Recombinant enzyme overexpressed in E. coli.
Residue:1144
BDBM50328814
NameBDBM50328814
Synonyms:(+/-)-6-((4-(2-(3-fluorophenethylamino)ethoxy)pyrrolidin-3-yl)methyl)-4-methylpyridin-2-amine 6-{[(3R,4R)-4-(2-{[2-(3-fluorophenyl)ethyl]amino}ethoxy)pyrrolidin-3-yl]methyl}-4-methylpyridin-2-amine CHEMBL1278132 US9212144, 2
TypeSmall organic molecule
Emp. Form.C21H29FN4O
Mol. Mass.372.4796
SMILESCc1cc(N)nc(C[C@@H]2CNC[C@@H]2OCCNCCc2cccc(F)c2)c1