Reaction Details
TargetCholinesterase
LigandBDBM50359391
Substrate/Competitorn/a
Meas. Tech.ChEMBL_1298067 (CHEMBL3129498)
IC50 460±n/a nM
Citation Bautista-Aguilera, OMEsteban, GBolea, INikolic, KAgbaba, DMoraleda, IIriepa, ISamadi, ASoriano, EUnzeta, MMarco-Contelles, J Design, synthesis, pharmacological evaluation, QSAR analysis, molecular modeling and ADMET of novel donepezil-indolyl hybrids as multipotent cholinesterase/monoamine oxidase inhibitors for the potential treatment of Alzheimer's disease. Eur J Med Chem75:82-95 (2014) 
 
Cholinesterase
Name:Cholinesterase
Type:Enzyme
Mol. Mass.:65643.35
Organism:Equus caballus (Horse)
Description:P81908
Residue:574
BDBM50359391
NameBDBM50359391
Synonyms:CHEMBL1929421
TypeSmall organic molecule
Emp. Form.C29H37N3O
Mol. Mass.443.6236
SMILESCN(CC#C)Cc1cc2cc(OCCCC3CCN(Cc4ccccc4)CC3)ccc2n1C