Reaction Details
TargetAcetylcholinesterase
LigandBDBM50449209
Substrate/Competitorn/a
Meas. Tech.ChEMBL_1298301 (CHEMBL3130754)
IC50 84±n/a nM
Citation Bautista-Aguilera, OMEsteban, GBolea, INikolic, KAgbaba, DMoraleda, IIriepa, ISamadi, ASoriano, EUnzeta, MMarco-Contelles, J Design, synthesis, pharmacological evaluation, QSAR analysis, molecular modeling and ADMET of novel donepezil-indolyl hybrids as multipotent cholinesterase/monoamine oxidase inhibitors for the potential treatment of Alzheimer's disease. Eur J Med Chem75:82-95 (2014) 
 
Acetylcholinesterase
Name:Acetylcholinesterase
Type:Enzyme
Mol. Mass.:71812.79
Organism:Electrophorus electricus (Electric eel)
Description:n/a
Residue:633
BDBM50449209
NameBDBM50449209
Synonyms:CHEMBL3127978
TypeSmall organic molecule
Emp. Form.C31H37N3O
Mol. Mass.467.645
SMILESCn1c(CNc2ccccc2)cc2cc(OCCCC3CCN(Cc4ccccc4)CC3)ccc12