Reaction Details
TargetSodium/glucose cotransporter 2
LigandBDBM50449243
Substrate/Competitorn/a
Meas. Tech.ChEMBL_1295137 (CHEMBL3128638)
IC50 163±n/a nM
Citation Putapatri, SRKanwal, ABanerjee, SKKantevari, S Synthesis of novel l-rhamnose derived acyclic C-nucleosides with substituted 1,2,3-triazole core as potent sodium-glucose co-transporter (SGLT) inhibitors. Bioorg Med Chem Lett24:1528-31 (2014) 
 
Sodium/glucose cotransporter 2
Name:Sodium/glucose cotransporter 2
Type:Protein
Mol. Mass.:72902.00
Organism:Homo sapiens (Human)
Description:P31639
Residue:672
BDBM50449243
NameBDBM50449243
Synonyms:CHEMBL3125152
TypeSmall organic molecule
Emp. Form.C16H21N3O5
Mol. Mass.335.355
SMILESCCOC(=O)c1nnn(c1[C@H](O)[C@@H](O)[C@H](C)O)-c1ccc(C)cc1