Reaction Details
TargetHistone deacetylase 6
LigandBDBM50354088
Substrate/Competitorn/a
Meas. Tech.ChEMBL_1298077 (CHEMBL3129508)
IC50 992±n/a nM
Citation Fukui, YNarita, KDan, SYamori, TIto, AYoshida, MKatoh, T Total synthesis of burkholdacs A and B and 5,6,20-tri-epi-burkholdac A: HDAC inhibition and antiproliferative activity. Eur J Med Chem76:301-13 (2014) 
 
Histone deacetylase 6
Name:Histone deacetylase 6
Type:PROTEIN
Mol. Mass.:125762.28
Organism:Mus musculus
Description:ChEMBL_1460074
Residue:1149
BDBM50354088
NameBDBM50354088
Synonyms:CHEMBL1836142
TypeSmall organic molecule
Emp. Form.C23H37N3O6S3
Mol. Mass.547.751
SMILESCC[C@H](C)[C@H]1NC(=O)[C@H]2CSSCC\C=C\[C@H](CC(=O)N[C@H](CCSC)C(=O)N2)OC(=O)C[C@@H]1O