Reaction Details
TargetNeuronal acetylcholine receptor subunit alpha-2/beta-2
LigandBDBM50452056
Substrate/Competitorn/a
Meas. Tech.ChEMBL_143225 (CHEMBL750086)
Ki 2.1±n/a nM
Citation Wei, ZLXiao, YKellar, KJKozikowski, AP Synthesis and pharmacological characterization of bivalent ligands of epibatidine at neuronal nicotinic acetylcholine receptors. Bioorg Med Chem Lett14:1855-8 (2004) 
 
Neuronal acetylcholine receptor subunit alpha-2/beta-2
Name:Neuronal acetylcholine receptor subunit alpha-2/beta-2
Type:n/a
Mol. Mass.:n/a
Description:ASSAY_ID of EBI is 143226
Components:This complex has 2 components.
Component 1
Name:Neuronal acetylcholine receptor subunit alpha-2
Synonyms:ACHA2_RAT Cholinergic, Nicotinic Alpha2Beta2 Chrna2
Type:Enzyme
Mol. Mass.:58597.25
Organism:Rattus norvegicus (Rat)
Description:P12389
Residue:511
Component 2
Name:Neuronal acetylcholine receptor subunit beta-2
Synonyms:ACHB2_RAT Chrnb2 Neuronal acetylcholine receptor non-alpha-1 chain
Type:Enzyme
Mol. Mass.:56910.32
Organism:Rattus norvegicus (Rat)
Description:P12390
Residue:500
BDBM50452056
NameBDBM50452056
Synonyms:CHEMBL417586
TypeSmall organic molecule
Emp. Form.C24H28Cl2N4
Mol. Mass.443.412
SMILESClc1ccc(cn1)C1CC2CCC1N2CCN1C2CCC1C(C2)c1ccc(Cl)nc1