Reaction Details
TargetNeuronal acetylcholine receptor subunit alpha-4/beta-2
LigandBDBM50452054
Substrate/Competitorn/a
Meas. Tech.ChEMBL_143728 (CHEMBL756124)
Ki 9.1±n/a nM
Citation Wei, ZLXiao, YKellar, KJKozikowski, AP Synthesis and pharmacological characterization of bivalent ligands of epibatidine at neuronal nicotinic acetylcholine receptors. Bioorg Med Chem Lett14:1855-8 (2004) 
 
Neuronal acetylcholine receptor subunit alpha-4/beta-2
Name:Neuronal acetylcholine receptor subunit alpha-4/beta-2
Type:n/a
Mol. Mass.:n/a
Description:n/a
Components:This complex has 0 components.
Component 1
Name:Neuronal acetylcholine receptor subunit alpha-4
Synonyms:ACHA4_RAT Cholinergic, Nicotinic Alpha4Beta2 Chrna4 Neuronal acetylcholine receptor (alpha4beta2 nAChR) Neuronal acetylcholine receptor subunit alpha 4 beta 2 | Neuronal acetylcholine receptor subunit alpha-4
Type:Enzyme
Mol. Mass.:70196.44
Organism:Rattus norvegicus (Rat)
Description:P09483
Residue:630
Component 2
Name:Neuronal acetylcholine receptor subunit beta-2
Synonyms:ACHB2_RAT Chrnb2 Neuronal acetylcholine receptor non-alpha-1 chain
Type:Enzyme
Mol. Mass.:56910.32
Organism:Rattus norvegicus (Rat)
Description:P12390
Residue:500
BDBM50452054
NameBDBM50452054
Synonyms:CHEMBL53620
TypeSmall organic molecule
Emp. Form.C28H36Cl2N4
Mol. Mass.499.518
SMILESClc1ccc(cn1)C1CC2CCC1N2CCCCCCN1C2CCC1C(C2)c1ccc(Cl)nc1