Reaction Details
TargetCoagulation factor X
LigandBDBM13646
Substrate/Competitorn/a
Meas. Tech.ChEBML_48815
Ki 48±n/a nM
Citation Nazaré, MMatter, HKlingler, OAl-Obeidi, FSchreuder, HZoller, GCzech, JLorenz, MDudda, APeyman, ANestler, HPUrmann, MBauer, ALaux, VWehner, VWill, DW Novel factor Xa inhibitors based on a benzoic acid scaffold and incorporating a neutral P1 ligand. Bioorg Med Chem Lett14:2801-5 (2004) 
 
Coagulation factor X
Name:Coagulation factor X
Type:Enzyme
Mol. Mass.:54726.60
Organism:Homo sapiens (Human)
Description:n/a
Residue:488
BDBM13646
NameBDBM13646
Synonyms:3-Oxybenzamide 32 | 3-[2-(2,4-dichlorophenyl)ethoxy]-4-(methylamino)-N-{[1-(pyridin-4-yl)piperidin-4-yl]methyl}benzamide
TypeSmall organic molecule
Emp. Form.C27H30Cl2N4O2
Mol. Mass.513.459
SMILESCNc1ccc(cc1OCCc1ccc(Cl)cc1Cl)C(=O)NCC1CCN(CC1)c1ccncc1