Reaction Details
TargetCoagulation factor X
LigandBDBM13676
Substrate/Competitorn/a
Meas. Tech.ChEBML_48815
Ki 600±n/a nM
Citation Nazaré, MMatter, HKlingler, OAl-Obeidi, FSchreuder, HZoller, GCzech, JLorenz, MDudda, APeyman, ANestler, HPUrmann, MBauer, ALaux, VWehner, VWill, DW Novel factor Xa inhibitors based on a benzoic acid scaffold and incorporating a neutral P1 ligand. Bioorg Med Chem Lett14:2801-5 (2004) 
 
Coagulation factor X
Name:Coagulation factor X
Type:Enzyme
Mol. Mass.:54726.60
Organism:Homo sapiens (Human)
Description:n/a
Residue:488
BDBM13676
NameBDBM13676
Synonyms:1-({3-[2-(2,4-dichlorophenyl)ethoxy]-4-methoxyphenyl}carbonyl)-4-(pyridin-4-ylmethyl)piperazine | 3-Oxybenzamide 62
TypeSmall organic molecule
Emp. Form.C26H27Cl2N3O3
Mol. Mass.500.417
SMILESCOc1ccc(cc1OCCc1ccc(Cl)cc1Cl)C(=O)N1CCN(Cc2ccncc2)CC1