Reaction Details
Target5-hydroxytryptamine receptor 3A/3B
LigandBDBM50014406
Substrate/Competitorn/a
Meas. Tech.ChEMBL_3038 (CHEMBL620656)
IC50 646±n/a nM
Citation Swain, CJBaker, RKneen, CMoseley, JSaunders, JSeward, EMStevenson, GBeer, MStanton, JWatling, K Novel 5-HT3 antagonists. Indole oxadiazoles. J Med Chem34:140-51 (1991) 5-hydroxytryptamine receptor 3A/3B
Name:5-hydroxytryptamine receptor 3A/3B
Type:n/a
Mol. Mass.:n/a
Description:ASSAY_ID of EBI is 2974
Components:This complex has 2 components.
Component 1
Name:5-hydroxytryptamine receptor 3B
Synonyms:5HT3B_RAT Serotonin (5-HT) receptor
Type:PROTEIN
Mol. Mass.:50328.78
Organism:Rattus norvegicus
Description:EBI_11885
Residue:437
Component 2
Name:5-hydroxytryptamine receptor 3A
Synonyms:5-HT3 5HT3A_RAT Htr3 Serotonin (5-HT) receptor | Zacopride site-R
Type:Enzyme Catalytic Domain
Mol. Mass.:55428.70
Organism:RAT
Description:5-HT3 HTR3A RAT::P35563
Residue:483
BDBM50014406
NameBDBM50014406
Synonyms:2-Me 5-HT 2-methyl-5-HT 3-(2-aminoethyl)-2-methyl-1H-indol-5-ol CHEMBL266591
TypeSmall organic molecule
Emp. Form.C11H14N2O
Mol. Mass.190.2417
SMILESCc1[nH]c2ccc(O)cc2c1CCN