Reaction Details
TargetGlycogen phosphorylase, muscle form
LigandBDBM50363873
Substrate/Competitorn/a
Meas. Tech.ChEMBL_70989 (CHEMBL680567)
Ki 4070000±n/a nM
Citation Pastor, MCruciani, GWatson, KA A strategy for the incorporation of water molecules present in a ligand binding site into a three-dimensional quantitative structure--activity relationship analysis. J Med Chem40:4089-102 (1998) 
 
Glycogen phosphorylase, muscle form
Name:Glycogen phosphorylase, muscle form
Type:PROTEIN
Mol. Mass.:97097.45
Organism:Homo sapiens (Human)
Description:ChEMBL_1449751
Residue:842
BDBM50363873
NameBDBM50363873
Synonyms:CHEMBL134529
TypeSmall organic molecule
Emp. Form.C8H15NO7
Mol. Mass.237.2072
SMILESCOC(=O)N[C@@H]1O[C@H](CO)[C@@H](O)[C@H](O)[C@H]1O