Reaction Details
TargetGlycogen phosphorylase, muscle form
LigandBDBM50454691
Substrate/Competitorn/a
Meas. Tech.ChEMBL_70989 (CHEMBL680567)
Ki 1790000±n/a nM
Citation Pastor, MCruciani, GWatson, KA A strategy for the incorporation of water molecules present in a ligand binding site into a three-dimensional quantitative structure--activity relationship analysis. J Med Chem40:4089-102 (1998) 
 
Glycogen phosphorylase, muscle form
Name:Glycogen phosphorylase, muscle form
Type:PROTEIN
Mol. Mass.:97097.45
Organism:Homo sapiens (Human)
Description:ChEMBL_1449751
Residue:842
BDBM50454691
NameBDBM50454691
Synonyms:MELIBIOSE
TypeSmall organic molecule
Emp. Form.C12H22O11
Mol. Mass.342.2965
SMILESOC[C@H]1O[C@H](OCC2O[C@@H](O)[C@H](O)[C@@H](O)[C@@H]2O)[C@H](O)[C@@H](O)[C@H]1O