Reaction Details
TargetGlycogen phosphorylase, muscle form
LigandBDBM50057736
Substrate/Competitorn/a
Meas. Tech.ChEMBL_70989 (CHEMBL680567)
Ki 2550000±n/a nM
Citation Pastor, MCruciani, GWatson, KA A strategy for the incorporation of water molecules present in a ligand binding site into a three-dimensional quantitative structure--activity relationship analysis. J Med Chem40:4089-102 (1998) 
 
Glycogen phosphorylase, muscle form
Name:Glycogen phosphorylase, muscle form
Type:PROTEIN
Mol. Mass.:97097.45
Organism:Homo sapiens (Human)
Description:ChEMBL_1449751
Residue:842
BDBM50057736
NameBDBM50057736
Synonyms:3,4,5-Trihydroxy-6-hydroxymethyl-tetrahydro-pyran-2-carboxylic acid methyl ester | CHEMBL284555
TypeSmall organic molecule
Emp. Form.C8H14O7
Mol. Mass.222.1926
SMILESCOC(=O)C1OC(CO)C(O)C(O)C1O