Reaction Details
TargetGlycogen phosphorylase, muscle form
LigandBDBM34103
Substrate/Competitorn/a
Meas. Tech.ChEMBL_70989 (CHEMBL680567)
Ki 2770000±n/a nM
Citation Pastor, MCruciani, GWatson, KA A strategy for the incorporation of water molecules present in a ligand binding site into a three-dimensional quantitative structure--activity relationship analysis. J Med Chem40:4089-102 (1998) 
 
Glycogen phosphorylase, muscle form
Name:Glycogen phosphorylase, muscle form
Type:PROTEIN
Mol. Mass.:97097.45
Organism:Homo sapiens (Human)
Description:ChEMBL_1449751
Residue:842
BDBM34103
NameBDBM34103
Synonyms:D-glucose glucose
Typen/a
Emp. Form.C6H12O6
Mol. Mass.180.1559
SMILESOC[C@H]1OC(O)[C@H](O)[C@@H](O)[C@@H]1O