Reaction Details
TargetGlycogen phosphorylase, muscle form
LigandBDBM50422221
Substrate/Competitorn/a
Meas. Tech.ChEMBL_70989 (CHEMBL680567)
Ki 3630781±n/a nM
Citation Pastor, MCruciani, GWatson, KA A strategy for the incorporation of water molecules present in a ligand binding site into a three-dimensional quantitative structure--activity relationship analysis. J Med Chem40:4089-102 (1998) 
 
Glycogen phosphorylase, muscle form
Name:Glycogen phosphorylase, muscle form
Type:PROTEIN
Mol. Mass.:97097.45
Organism:Homo sapiens (Human)
Description:ChEMBL_1449751
Residue:842
BDBM50422221
NameBDBM50422221
Synonyms:CHEMBL133751
TypeSmall organic molecule
Emp. Form.C14H19NO6S
Mol. Mass.329.369
SMILESOC[C@H]1O[C@@H](SCC(=O)Nc2ccccc2)[C@H](O)[C@@H](O)[C@@H]1O