Reaction Details
TargetGlycogen phosphorylase, muscle form
LigandBDBM50077949
Substrate/Competitorn/a
Meas. Tech.ChEMBL_70989 (CHEMBL680567)
Ki 1780000±n/a nM
Citation Pastor, MCruciani, GWatson, KA A strategy for the incorporation of water molecules present in a ligand binding site into a three-dimensional quantitative structure--activity relationship analysis. J Med Chem40:4089-102 (1998) 
 
Glycogen phosphorylase, muscle form
Name:Glycogen phosphorylase, muscle form
Type:PROTEIN
Mol. Mass.:97097.45
Organism:Homo sapiens (Human)
Description:ChEMBL_1449751
Residue:842
BDBM50077949
NameBDBM50077949
Synonyms:2-Aminomethyl-6-hydroxymethyl-tetrahydro-pyran-3,4,5-triol CHEMBL71477
TypeSmall organic molecule
Emp. Form.C7H15NO5
Mol. Mass.193.1977
SMILESNCC1OC(CO)C(O)C(O)C1O