Reaction Details
TargetGlycogen phosphorylase, muscle form
LigandBDBM50454694
Substrate/Competitorn/a
Meas. Tech.ChEMBL_70989 (CHEMBL680567)
Ki 549541±n/a nM
Citation Pastor, MCruciani, GWatson, KA A strategy for the incorporation of water molecules present in a ligand binding site into a three-dimensional quantitative structure--activity relationship analysis. J Med Chem40:4089-102 (1998) 
 
Glycogen phosphorylase, muscle form
Name:Glycogen phosphorylase, muscle form
Type:PROTEIN
Mol. Mass.:97097.45
Organism:Homo sapiens (Human)
Description:ChEMBL_1449751
Residue:842
BDBM50454694
NameBDBM50454694
Synonyms:CHEMBL35457
TypeSmall organic molecule
Emp. Form.C10H15N3O8
Mol. Mass.305.2414
SMILESCC(=O)NN1C(=O)NC2(OC(CO)C(O)C(O)C2O)C1=O