Reaction Details
Target5-hydroxytryptamine receptor 3A/3B
LigandBDBM50455917
Substrate/Competitorn/a
Meas. Tech.ChEMBL_3381 (CHEMBL619411)
IC50 174±n/a nM
Citation Swain, CJBaker, RKneen, CHerbert, RMoseley, JSaunders, JSeward, EMStevenson, GIBeer, MStanton, J Novel 5-HT3 antagonists: indol-3-ylspiro(azabicycloalkane-3,5'(4'H)-oxazoles). J Med Chem35:1019-31 (1992) 5-hydroxytryptamine receptor 3A/3B
Name:5-hydroxytryptamine receptor 3A/3B
Type:n/a
Mol. Mass.:n/a
Description:ASSAY_ID of EBI is 2974
Components:This complex has 2 components.
Component 1
Name:5-hydroxytryptamine receptor 3B
Synonyms:5HT3B_RAT Serotonin (5-HT) receptor
Type:PROTEIN
Mol. Mass.:50328.78
Organism:Rattus norvegicus
Description:EBI_11885
Residue:437
Component 2
Name:5-hydroxytryptamine receptor 3A
Synonyms:5-HT3 5HT3A_RAT Htr3 Serotonin (5-HT) receptor | Zacopride site-R
Type:Enzyme Catalytic Domain
Mol. Mass.:55428.70
Organism:RAT
Description:5-HT3 HTR3A RAT::P35563
Residue:483
BDBM50455917
NameBDBM50455917
Synonyms:CHEMBL268180
TypeSmall organic molecule
Emp. Form.C25H27N3O
Mol. Mass.385.5014
SMILESCn1cc(C2=NCC3(CC4CCC(C3)N4Cc3ccccc3)O2)c2ccccc12