Reaction Details
Target5-hydroxytryptamine receptor 6
LigandBDBM50001827
Substrate/Competitorn/a
Meas. Tech.ChEMBL_304014 (CHEMBL840097)
Ki 0.13±n/a nM
Citation López-Rodríguez, MLBenhamú, Bde la Fuente, TSanz, APardo, LCampillo, M A three-dimensional pharmacophore model for 5-hydroxytryptamine6 (5-HT6) receptor antagonists. J Med Chem48:4216-9 (2005) 
 
5-hydroxytryptamine receptor 6
Name:5-hydroxytryptamine receptor 6
Type:G Protein-Coupled Receptor (GPCR)
Mol. Mass.:46968.43
Organism:Homo sapiens (Human)
Description:P50406
Residue:440
BDBM50001827
NameBDBM50001827
Synonyms:CHEMBL363792
TypeSmall organic molecule
Emp. Form.C21H22N2O3S
Mol. Mass.382.476
SMILESCON1CCN(CC1)c1ccc(cc1)S(=O)(=O)c1cccc2ccccc12