Reaction Details
Target5-hydroxytryptamine receptor 6
LigandBDBM50090530
Substrate/Competitorn/a
Meas. Tech.ChEMBL_304014 (CHEMBL840097)
Ki 1.3±n/a nM
Citation López-Rodríguez, MLBenhamú, Bde la Fuente, TSanz, APardo, LCampillo, M A three-dimensional pharmacophore model for 5-hydroxytryptamine6 (5-HT6) receptor antagonists. J Med Chem48:4216-9 (2005) 
 
5-hydroxytryptamine receptor 6
Name:5-hydroxytryptamine receptor 6
Type:G Protein-Coupled Receptor (GPCR)
Mol. Mass.:46968.43
Organism:Homo sapiens (Human)
Description:P50406
Residue:440
BDBM50090530
NameBDBM50090530
Synonyms:6-(1,2,3,5,8,8a-Hexahydro-indolizin-7-yl)-1-(naphthalene-1-sulfonyl)-1H-indole | CHEMBL416638
TypeSmall organic molecule
Emp. Form.C26H24N2O2S
Mol. Mass.428.546
SMILESO=S(=O)(c1cccc2ccccc12)n1ccc2ccc(cc12)C1=CCN2CCCC2C1