Reaction Details
TargetKappa-type opioid receptor
LigandBDBM50002068
Substrate/Competitorn/a
Meas. Tech.ChEMBL_304044 (CHEMBL840221)
Ki 380±n/a nM
Citation Peng, YKeenan, SMZhang, QKholodovych, VWelsh, WJ 3D-QSAR comparative molecular field analysis on opioid receptor antagonists: pooling data from different studies. J Med Chem48:1620-9 (2005) 
 
Kappa-type opioid receptor
Name:Kappa-type opioid receptor
Type:G Protein-Coupled Receptor (GPCR)
Mol. Mass.:42744.99
Organism:Cavia porcellus (domestic guinea pig)
Description:P41144
Residue:380
BDBM50002068
NameBDBM50002068
Synonyms:CHEMBL606740
TypeSmall organic molecule
Emp. Form.C25H26N2O3
Mol. Mass.402.4855
SMILES[H][C@]12Oc3c4c(C[C@@]5([H])N(CCC)CC[C@@]14[C@@]5(O)Cc1c2[nH]c2ccccc12)ccc3O