Reaction Details
TargetMu-type opioid receptor
LigandBDBM50002039
Substrate/Competitorn/a
Meas. Tech.ChEMBL_304036 (CHEMBL840214)
Ki 26±n/a nM
Citation Peng, YKeenan, SMZhang, QKholodovych, VWelsh, WJ 3D-QSAR comparative molecular field analysis on opioid receptor antagonists: pooling data from different studies. J Med Chem48:1620-9 (2005) 
 
Mu-type opioid receptor
Name:Mu-type opioid receptor
Type:G Protein-Coupled Receptor (GPCR)
Mol. Mass.:44503.11
Organism:Rattus norvegicus (rat)
Description:Competition binding assays were carried out using membrane preparations from transfected HN9.10 cells that constitutively expressed the mu opioid receptor.
Residue:398
BDBM50002039
NameBDBM50002039
Synonyms:CHEMBL427546
TypeSmall organic molecule
Emp. Form.C26H24N2O3
Mol. Mass.412.4804
SMILES[H][C@@]12Oc3c4c(CC5N(C)CCC14[C@@]5(O)Cc1cc(cnc21)-c1ccccc1)ccc3O