Reaction Details
TargetKappa-type opioid receptor
LigandBDBM50002106
Substrate/Competitorn/a
Meas. Tech.ChEMBL_304044 (CHEMBL840221)
Ki 5.9±n/a nM
Citation Peng, YKeenan, SMZhang, QKholodovych, VWelsh, WJ 3D-QSAR comparative molecular field analysis on opioid receptor antagonists: pooling data from different studies. J Med Chem48:1620-9 (2005) 
 
Kappa-type opioid receptor
Name:Kappa-type opioid receptor
Type:G Protein-Coupled Receptor (GPCR)
Mol. Mass.:42744.99
Organism:Cavia porcellus (domestic guinea pig)
Description:P41144
Residue:380
BDBM50002106
NameBDBM50002106
Synonyms:CHEMBL370966
TypeSmall organic molecule
Emp. Form.C29H35NO3
Mol. Mass.445.5931
SMILESOc1cccc2CC3N(CC4CC4)CCC4(CC(=O)CC[C@@]34OCCCc3ccccc3)c12