Reaction Details
TargetMu-type opioid receptor
LigandBDBM50002106
Substrate/Competitorn/a
Meas. Tech.ChEMBL_304036 (CHEMBL840214)
Ki 0.40±n/a nM
Citation Peng, YKeenan, SMZhang, QKholodovych, VWelsh, WJ 3D-QSAR comparative molecular field analysis on opioid receptor antagonists: pooling data from different studies. J Med Chem48:1620-9 (2005) 
 
Mu-type opioid receptor
Name:Mu-type opioid receptor
Type:G Protein-Coupled Receptor (GPCR)
Mol. Mass.:44503.11
Organism:Rattus norvegicus (rat)
Description:Competition binding assays were carried out using membrane preparations from transfected HN9.10 cells that constitutively expressed the mu opioid receptor.
Residue:398
BDBM50002106
NameBDBM50002106
Synonyms:CHEMBL370966
TypeSmall organic molecule
Emp. Form.C29H35NO3
Mol. Mass.445.5931
SMILESOc1cccc2CC3N(CC4CC4)CCC4(CC(=O)CC[C@@]34OCCCc3ccccc3)c12