Reaction Details
TargetSubstance-K receptor
LigandBDBM50003000
Substrate/Competitorn/a
Meas. Tech.ChEMBL_448551 (CHEMBL897700)
Ki 0.40±n/a nM
Citation Sisto, AAltamura, MCardinali, FD'Andrea, PRossi, CFattori, D alpha,alpha-Cyclic aminoacids as useful scaffolds for the preparation of hNK(2) receptor antagonists. Bioorg Med Chem Lett17:4841-4 (2007) 
 
Substance-K receptor
Name:Substance-K receptor
Type:Protein
Mol. Mass.:44455.78
Organism:Homo sapiens (Human)
Description:P21452
Residue:398
BDBM50003000
NameBDBM50003000
Synonyms:CHEMBL394889
TypeSmall organic molecule
Emp. Form.C34H44N4O3S
Mol. Mass.588.803
SMILESCC1CCCCN1CCCNC(=O)[C@@H](Cc1ccccc1)NC(=O)C1(CCCCC1)NC(=O)c1cc2ccccc2s1