Reaction Details
TargetMuscarinic acetylcholine receptor M4
LigandBDBM50003014
Substrate/Competitorn/a
Meas. Tech.ChEMBL_461883 (CHEMBL929019)
Ki 11482±n/a nM
Citation Piergentili, AQuaglia, WGiannella, MDel Bello, FBuccioni, MNesi, MMatucci, R Rapid novel divergent synthesis and muscarinic agonist profile of all four optical isomers of N,N,N-trimethyl(6-methyl-1,4-dioxan-2-yl)methanaminium iodide. Bioorg Med Chem Lett18:614-8 (2008) 
 
Muscarinic acetylcholine receptor M4
Name:Muscarinic acetylcholine receptor M4
Type:Enzyme Catalytic Domain
Mol. Mass.:53079.31
Organism:Homo sapiens (Human)
Description:Cholinergic, muscarinic M4 CHRM4 HUMAN M3::P08173
Residue:479
BDBM50003014
NameBDBM50003014
Synonyms:CHEMBL228144
TypeSmall organic molecule
Emp. Form.C9H20INO2
Mol. Mass.301.1651
SMILES[I-].CC1COCC(C[N+](C)(C)C)O1