Reaction Details
TargetMuscarinic acetylcholine receptor M5
LigandBDBM50003014
Substrate/Competitorn/a
Meas. Tech.ChEMBL_461884 (CHEMBL929020)
Ki 7762±n/a nM
Citation Piergentili, AQuaglia, WGiannella, MDel Bello, FBuccioni, MNesi, MMatucci, R Rapid novel divergent synthesis and muscarinic agonist profile of all four optical isomers of N,N,N-trimethyl(6-methyl-1,4-dioxan-2-yl)methanaminium iodide. Bioorg Med Chem Lett18:614-8 (2008) 
 
Muscarinic acetylcholine receptor M5
Name:Muscarinic acetylcholine receptor M5
Type:PROTEIN
Mol. Mass.:60102.35
Organism:Homo sapiens (Human)
Description:ChEMBL_1517990
Residue:532
BDBM50003014
NameBDBM50003014
Synonyms:CHEMBL228144
TypeSmall organic molecule
Emp. Form.C9H20INO2
Mol. Mass.301.1651
SMILES[I-].CC1COCC(C[N+](C)(C)C)O1