Reaction Details
TargetMuscarinic acetylcholine receptor M2
LigandBDBM50415218
Substrate/Competitorn/a
Meas. Tech.ChEMBL_461881 (CHEMBL929017)
Ki 61660±n/a nM
Citation Piergentili, AQuaglia, WGiannella, MDel Bello, FBuccioni, MNesi, MMatucci, R Rapid novel divergent synthesis and muscarinic agonist profile of all four optical isomers of N,N,N-trimethyl(6-methyl-1,4-dioxan-2-yl)methanaminium iodide. Bioorg Med Chem Lett18:614-8 (2008) 
 
Muscarinic acetylcholine receptor M2
Name:Muscarinic acetylcholine receptor M2
Type:GPCR
Mol. Mass.:51730.61
Organism:Homo sapiens (Human)
Description:P08172
Residue:466
BDBM50415218
NameBDBM50415218
Synonyms:CHEMBL404557
TypeSmall organic molecule
Emp. Form.C9H20NO2
Mol. Mass.174.2601
SMILESC[C@@H]1COC[C@@H](C[N+](C)(C)C)O1