Reaction Details
TargetMuscarinic acetylcholine receptor M5
LigandBDBM10759
Substrate/Competitorn/a
Meas. Tech.ChEMBL_461884 (CHEMBL929020)
Ki 9772±n/a nM
Citation Piergentili, AQuaglia, WGiannella, MDel Bello, FBuccioni, MNesi, MMatucci, R Rapid novel divergent synthesis and muscarinic agonist profile of all four optical isomers of N,N,N-trimethyl(6-methyl-1,4-dioxan-2-yl)methanaminium iodide. Bioorg Med Chem Lett18:614-8 (2008) 
 
Muscarinic acetylcholine receptor M5
Name:Muscarinic acetylcholine receptor M5
Type:PROTEIN
Mol. Mass.:60102.35
Organism:Homo sapiens (Human)
Description:ChEMBL_1517990
Residue:532
BDBM10759
NameBDBM10759
Synonyms:2-acetoxyethyl(trimethyl)ammonium;bromide CHEMBL667 [2-(acetyloxy)ethyl]trimethylazanium acetylcholine chloride | cid_6060
TypeSmall Organic Molecule
Emp. Form.C7H16NO2
Mol. Mass.146.2069
SMILESCC(=O)OCC[N+](C)(C)C