Reaction Details
TargetHistidine-rich protein PFHRP-II
LigandBDBM50003661
Substrate/Competitorn/a
Meas. Tech.ChEMBL_500704 (CHEMBL966920)
IC50 15900±n/a nM
Citation Sunduru, NSrivastava, KRajakumar, SPuri, SKSaxena, JKChauhan, PM Synthesis of novel thiourea, thiazolidinedione and thioparabanic acid derivatives of 4-aminoquinoline as potent antimalarials. Bioorg Med Chem Lett19:2570-3 (2009) 
 
Histidine-rich protein PFHRP-II
Name:Histidine-rich protein PFHRP-II
Type:PROTEIN
Mol. Mass.:35156.49
Organism:Plasmodium falciparum
Description:ChEMBL_500704
Residue:332
BDBM50003661
NameBDBM50003661
Synonyms:CHEMBL466910
TypeSmall organic molecule
Emp. Form.C19H18Cl2N4S
Mol. Mass.405.344
SMILESClc1ccc2c(NCCCNC(=S)Nc3ccccc3Cl)ccnc2c1