Reaction Details
TargetPeroxisome proliferator-activated receptor alpha
LigandBDBM50004755
Substrate/Competitorn/a
Meas. Tech.ChEMBL_922065 (CHEMBL3077607)
EC50 1.00±n/a nM
Citation  TBA Med Chem Res22:287-302 (2013)    Article
 
Peroxisome proliferator-activated receptor alpha
Name:Peroxisome proliferator-activated receptor alpha
Type:Enzyme
Mol. Mass.:52222.08
Organism:Homo sapiens (Human)
Description:Q07869
Residue:468
BDBM50004755
NameBDBM50004755
Synonyms:CHEMBL2237300
TypeSmall organic molecule
Emp. Form.C27H31NO5
Mol. Mass.449.5387
SMILESCc1oc(nc1CCOc1ccc(C[C@H](Oc2ccccc2)C(O)=O)cc1)C1CCCCC1